Reaction Details
TargetProtein kinase C delta type
LigandBDBM3153
Substrate/Competitorn/a
Meas. Tech.ChEMBL_160768 (CHEMBL766309)
IC50 1±n/a nM
Citation Lai, YSMendoza, JSJagdmann, GEMenaldino, DSBiggers, CKHeerding, JMWilson, JWHall, SEJiang, JBJanzen, WPBallas, LM Synthesis and protein kinase C inhibitory activities of balanol analogs with replacement of the perhydroazepine moiety. J Med Chem40:226-35 (1997) 
 
Protein kinase C delta type
Name:Protein kinase C delta type
Type:Enzyme
Mol. Mass.:77516.79
Organism:Homo sapiens (Human)
Description:The recombinant human PKC enzymes were produced using a baculovirus expression system in SF9 cells
Residue:676
BDBM3153
NameBDBM3153
Synonyms:2-{[2,6-dihydroxy-4-({[(1R,2R)-2-[(4-hydroxybenzene)amido]cyclopentyl]oxy}carbonyl)phenyl]carbonyl}-3-hydroxybenzoic acid CHEMBL52529
TypeSmall organic molecule
Emp. Form.C27H23NO10
Mol. Mass.521.4722
SMILESOC(=O)c1cccc(O)c1C(=O)c1c(O)cc(cc1O)C(=O)O[C@@H]1CCC[C@H]1NC(=O)c1ccc(O)cc1