Reaction Details
TargetcAMP-dependent protein kinase catalytic subunit alpha
LigandBDBM50055670
Substrate/Competitorn/a
Meas. Tech.ChEMBL_161873 (CHEMBL770106)
IC50 1700±n/a nM
Citation Lai, YSMendoza, JSJagdmann, GEMenaldino, DSBiggers, CKHeerding, JMWilson, JWHall, SEJiang, JBJanzen, WPBallas, LM Synthesis and protein kinase C inhibitory activities of balanol analogs with replacement of the perhydroazepine moiety. J Med Chem40:226-35 (1997) 
 
cAMP-dependent protein kinase catalytic subunit alpha
Name:cAMP-dependent protein kinase catalytic subunit alpha
Type:Enzyme Catalytic Subunit
Mol. Mass.:40598.73
Organism:Homo sapiens (Human)
Description:n/a
Residue:351
BDBM50055670
NameBDBM50055670
Synonyms:4-(2-Carboxy-6-hydroxy-benzoyl)-3,5-dihydroxy-benzoic acid (3R,4R)-3-(4-hydroxy-benzoylamino)-1-aza-bicyclo[3.2.2]non-4-yl ester | CHEMBL78129
TypeSmall organic molecule
Emp. Form.C30H28N2O10
Mol. Mass.576.5507
SMILESOC(=O)c1cccc(O)c1C(=O)c1c(O)cc(cc1O)C(=O)O[C@@H]1C2CCN(CC2)C[C@H]1NC(=O)c1ccc(O)cc1