Reaction Details
TargetcAMP-dependent protein kinase catalytic subunit alpha
LigandBDBM50055672
Substrate/Competitorn/a
Meas. Tech.ChEMBL_161873 (CHEMBL770106)
IC50 230±n/a nM
Citation Lai, YSMendoza, JSJagdmann, GEMenaldino, DSBiggers, CKHeerding, JMWilson, JWHall, SEJiang, JBJanzen, WPBallas, LM Synthesis and protein kinase C inhibitory activities of balanol analogs with replacement of the perhydroazepine moiety. J Med Chem40:226-35 (1997) 
 
cAMP-dependent protein kinase catalytic subunit alpha
Name:cAMP-dependent protein kinase catalytic subunit alpha
Type:Enzyme Catalytic Subunit
Mol. Mass.:40598.73
Organism:Homo sapiens (Human)
Description:n/a
Residue:351
BDBM50055672
NameBDBM50055672
Synonyms:4-(2-Carboxy-6-hydroxy-benzoyl)-3,5-dihydroxy-benzoic acid (1R,2R,4S)-2-(4-hydroxy-benzoylamino)-4-hydroxymethyl-cyclopentyl ester | CHEMBL75661
TypeSmall organic molecule
Emp. Form.C28H25NO11
Mol. Mass.551.4982
SMILESOC[C@H]1C[C@@H](NC(=O)c2ccc(O)cc2)[C@@H](C1)OC(=O)c1cc(O)c(C(=O)c2c(O)cccc2C(O)=O)c(O)c1