Reaction Details
TargetcAMP-dependent protein kinase catalytic subunit alpha
LigandBDBM3151
Substrate/Competitorn/a
Meas. Tech.ChEMBL_161873 (CHEMBL770106)
IC50 350±n/a nM
Citation Lai, YSMendoza, JSJagdmann, GEMenaldino, DSBiggers, CKHeerding, JMWilson, JWHall, SEJiang, JBJanzen, WPBallas, LM Synthesis and protein kinase C inhibitory activities of balanol analogs with replacement of the perhydroazepine moiety. J Med Chem40:226-35 (1997) 
 
cAMP-dependent protein kinase catalytic subunit alpha
Name:cAMP-dependent protein kinase catalytic subunit alpha
Type:Enzyme Catalytic Subunit
Mol. Mass.:40598.73
Organism:Homo sapiens (Human)
Description:n/a
Residue:351
BDBM3151
NameBDBM3151
Synonyms:2-{[2,6-dihydroxy-4-({[(3R,4R)-3-[(4-hydroxybenzene)amido]piperidin-4-yl]oxy}carbonyl)phenyl]carbonyl}-3-hydroxybenzoic acid CHEMBL67442
TypeSmall organic molecule
Emp. Form.C27H24N2O10
Mol. Mass.536.4869
SMILESOC(=O)c1cccc(O)c1C(=O)c1c(O)cc(cc1O)C(=O)O[C@@H]1CCNC[C@H]1NC(=O)c1ccc(O)cc1