Reaction Details
TargetD(2) dopamine receptor
LigandBDBM21398
Substrate/Competitorn/a
Meas. Tech.ChEMBL_60211 (CHEMBL672173)
Ki 4.8±n/a nM
Citation Thurkauf, AYuan, JChen, XHe, XSWasley, JWHutchison, AWoodruff, KHMeade, RHoffman, DCDonovan, HJones-Hertzog, DK 2-Phenyl-4(5)-[[4-(pyrimidin-2-yl)piperazin-1-yl]methyl]imidazole. A highly selective antagonist at cloned human D4 receptors. J Med Chem40:1-3 (1997) 
 
D(2) dopamine receptor
Name:D(2) dopamine receptor
Type:Cell-surface receptors
Mol. Mass.:50647.10
Organism:Homo sapiens (Human)
Description:P14416
Residue:443
BDBM21398
NameBDBM21398
Synonyms:4-[4-(4-Chloro-phenyl)-4-hydroxy-piperidin-1-yl]-1-(4-fluoro-phenyl)-butan-1-one;propionate(HCl) CHEMBL54 Haloperidol | Haloperidol, 1
TypeSmall organic molecule
Emp. Form.C21H23ClFNO2
Mol. Mass.375.864
SMILESOC1(CCN(CCCC(=O)c2ccc(F)cc2)CC1)c1ccc(Cl)cc1