Reaction Details
TargetD(3) dopamine receptor
LigandBDBM50055810
Substrate/Competitorn/a
Meas. Tech.ChEMBL_62266 (CHEMBL675668)
Ki 193±n/a nM
Citation Thurkauf, AYuan, JChen, XHe, XSWasley, JWHutchison, AWoodruff, KHMeade, RHoffman, DCDonovan, HJones-Hertzog, DK 2-Phenyl-4(5)-[[4-(pyrimidin-2-yl)piperazin-1-yl]methyl]imidazole. A highly selective antagonist at cloned human D4 receptors. J Med Chem40:1-3 (1997) 
 
D(3) dopamine receptor
Name:D(3) dopamine receptor
Type:n/a
Mol. Mass.:44243.43
Organism:Homo sapiens (Human)
Description:n/a
Residue:400
BDBM50055810
NameBDBM50055810
Synonyms:1-Phenyl-4-(2-phenyl-3H-imidazol-4-ylmethyl)-piperazine CHEMBL103871
TypeSmall organic molecule
Emp. Form.C20H22N4
Mol. Mass.318.4155
SMILESC(N1CCN(CC1)c1ccccc1)c1cnc([nH]1)-c1ccccc1