Reaction Details
TargetAlpha-2A adrenergic receptor
LigandBDBM50055835
Substrate/Competitorn/a
Meas. Tech.ChEMBL_33066 (CHEMBL647965)
Ki 4.9±n/a nM
Citation Munk, SAHarcourt, DAArasasingham, PNBurke, JAKharlamb, ABManlapaz, CAPadillo, EURoberts, DRunde, EWilliams, LWheeler, LAGarst, ME Synthesis and evaluation of 2-(arylamino)imidazoles as alpha 2-adrenergic agonists. J Med Chem40:18-23 (1997) 
 
Alpha-2A adrenergic receptor
Name:Alpha-2A adrenergic receptor
Type:Enzyme
Mol. Mass.:48979.91
Organism:Homo sapiens (Human)
Description:P08913
Residue:450
BDBM50055835
NameBDBM50055835
Synonyms:(4-tert-Butyl-3-methoxy-2,6-dimethyl-phenyl)-(1H-imidazol-2-yl)-amine | CHEMBL75257
TypeSmall organic molecule
Emp. Form.C16H23N3O
Mol. Mass.273.3733
SMILESCOc1c(C)c(Nc2ncc[nH]2)c(C)cc1C(C)(C)C