Reaction Details
Target5-hydroxytryptamine receptor 1A
LigandBDBM50039824
Substrate/Competitorn/a
Meas. Tech.ChEMBL_617 (CHEMBL615167)
EC50 0.78±n/a nM
Citation Kuipers, WKruse, CGvan Wijngaarden, IStandaar, PJTulp, MTVeldman, NSpek, ALIJzerman, AP 5-HT1A-versus D2-receptor selectivity of flesinoxan and analogous N4-substituted N1-arylpiperazines. J Med Chem40:300-12 (1997) 
 
5-hydroxytryptamine receptor 1A
Name:5-hydroxytryptamine receptor 1A
Type:n/a
Mol. Mass.:46122.49
Organism:Homo sapiens (Human)
Description:n/a
Residue:422
BDBM50039824
NameBDBM50039824
Synonyms:CHEMBL81728 | N-{2-[4-(2,3-Dihydro-benzo[1,4]dioxin-5-yl)-piperazin-1-yl]-ethyl}-4-fluoro-benzamide
TypeSmall organic molecule
Emp. Form.C21H24FN3O3
Mol. Mass.385.432
SMILESFc1ccc(cc1)C(=O)NCCN1CCN(CC1)c1cccc2OCCOc12