Reaction Details
TargetGastrin/cholecystokinin type B receptor
LigandBDBM50056101
Substrate/Competitorn/a
Meas. Tech.ChEMBL_48592 (CHEMBL662472)
IC50 0.11±n/a nM
Citation Semple, GRyder, HRooker, DPBatt, ARKendrick, DASzelke, MOhta, MSatoh, MNishida, AAkuzawa, SMiyata, K (3R)-N-(1-(tert-butylcarbonylmethyl)-2,3-dihydro-2-oxo-5-(2-pyridyl)-1H-1,4-benzodiazepin-3-yl)-N'-(3-(methylamino)phenyl)urea (YF476): a potent and orally active gastrin/CCK-B antagonist. J Med Chem40:331-41 (1997) 
 
Gastrin/cholecystokinin type B receptor
Name:Gastrin/cholecystokinin type B receptor
Type:Enzyme Catalytic Domain
Mol. Mass.:48980.43
Organism:RAT
Description:Cholecystokinin A CCKBR RAT::P30553
Residue:452
BDBM50056101
NameBDBM50056101
Synonyms:1-[(R)-2-Oxo-1-(2-oxo-2-o-tolyl-ethyl)-5-phenyl-2,3-dihydro-1H-benzo[e][1,4]diazepin-3-yl]-3-m-tolyl-urea YM022 | YM022 Racemate
TypeSmall organic molecule
Emp. Form.C32H28N4O3
Mol. Mass.516.5897
SMILESCc1cccc(NC(=O)N[C@@H]2N=C(c3ccccc3)c3ccccc3N(CC(=O)c3ccccc3C)C2=O)c1