Reaction Details
TargetNeuronal acetylcholine receptor subunit alpha-7
LigandBDBM50035398
Substrate/Competitorn/a
Meas. Tech.ChEMBL_144029 (CHEMBL750444)
Ki 4050±n/a nM
Citation Lin, NHGunn, DERyther, KBGarvey, DSDonnelly-Roberts, DLDecker, MWBrioni, JDBuckley, MJRodrigues, ADMarsh, KGAnderson, DJBuccafusco, JJPrendergast, MASullivan, JPWilliams, MArneric, SPHolladay, MW Structure-activity studies on 2-methyl-3-(2(S)-pyrrolidinylmethoxy) pyridine (ABT-089): an orally bioavailable 3-pyridyl ether nicotinic acetylcholine receptor ligand with cognition-enhancing properties. J Med Chem40:385-90 (1997) 
 
Neuronal acetylcholine receptor subunit alpha-7
Name:Neuronal acetylcholine receptor subunit alpha-7
Type:n/a
Mol. Mass.:56448.33
Organism:Homo sapiens (Human)
Description: CHRNA7 (NACHRA7)
Residue:502
BDBM50035398
NameBDBM50035398
Synonyms:(S)-1-Methyl-2-(3-methyl-isoxazol-5-yl)-pyrrolidinium 3-Methyl-5-((S)-1-methyl-pyrrolidin-2-yl)-isoxazole CHEMBL274525
TypeSmall organic molecule
Emp. Form.C9H14N2O
Mol. Mass.166.2203
SMILESCN1CCC[C@H]1c1cc(C)no1