Reaction Details
TargetNeprilysin
LigandBDBM50056249
Substrate/Competitorn/a
Meas. Tech.ChEMBL_144635 (CHEMBL752993)
IC50 3±n/a nM
Citation Ksander, GMde Jesus, RYuan, AGhai, RDTrapani, AMcMartin, CBohacek, R Ortho-substituted benzofused macrocyclic lactams as zinc metalloprotease inhibitors. J Med Chem40:495-505 (1997) 
 
Neprilysin
Name:Neprilysin
Type:Enzyme
Mol. Mass.:85505.38
Organism:Homo sapiens (Human)
Description:P08473
Residue:750
BDBM50056249
NameBDBM50056249
Synonyms:(6S,9S)-6-Mercaptomethyl-7-oxo-5,6,7,8,9,10,11,12,13,14-decahydro-8-aza-benzocyclododecene-9-carboxylic acid | CHEMBL342091
TypeSmall organic molecule
Emp. Form.C17H23NO3S
Mol. Mass.321.434
SMILESOC(=O)[C@@H]1CCCCCc2ccccc2C[C@H](CS)C(=O)N1