Reaction Details
TargetNeprilysin
LigandBDBM50056257
Substrate/Competitorn/a
Meas. Tech.ChEMBL_144635 (CHEMBL752993)
IC50 900±n/a nM
Citation Ksander, GMde Jesus, RYuan, AGhai, RDTrapani, AMcMartin, CBohacek, R Ortho-substituted benzofused macrocyclic lactams as zinc metalloprotease inhibitors. J Med Chem40:495-505 (1997) 
 
Neprilysin
Name:Neprilysin
Type:Enzyme
Mol. Mass.:85505.38
Organism:Homo sapiens (Human)
Description:P08473
Residue:750
BDBM50056257
NameBDBM50056257
Synonyms:(6S,9S)-9-Mercaptomethyl-8-oxo-5,6,7,8,9,10,11,12,13,14,15,16-dodecahydro-7-aza-benzocyclotetradecene-6-carboxylic acid | CHEMBL433702
TypeSmall organic molecule
Emp. Form.C19H27NO3S
Mol. Mass.349.488
SMILESOC(=O)[C@@H]1Cc2ccccc2CCCCCCC[C@H](CS)C(=O)N1