Reaction Details
TargetNeprilysin
LigandBDBM50056253
Substrate/Competitorn/a
Meas. Tech.ChEMBL_144636 (CHEMBL752994)
IC50 67±n/a nM
Citation Ksander, GMde Jesus, RYuan, AGhai, RDMcMartin, CBohacek, R Meta-substituted benzofused macrocyclic lactams as zinc metalloprotease inhibitors. J Med Chem40:506-14 (1997) 
 
Neprilysin
Name:Neprilysin
Type:Enzyme
Mol. Mass.:85505.38
Organism:Homo sapiens (Human)
Description:P08473
Residue:750
BDBM50056253
NameBDBM50056253
Synonyms:(6S,9S)-9-Mercaptomethyl-8-oxo-6,7,8,9,10,11,12,13,14,15-decahydro-5H-7-aza-benzocyclotridecene-6-carboxylic acid | CHEMBL147755
TypeSmall organic molecule
Emp. Form.C18H25NO3S
Mol. Mass.335.461
SMILESOC(=O)[C@@H]1Cc2ccccc2CCCCCC[C@H](CS)C(=O)N1