Reaction Details
TargetThermolysin
LigandBDBM50056254
Substrate/Competitorn/a
Meas. Tech.ChEMBL_210397 (CHEMBL814127)
IC50 49000±n/a nM
Citation Ksander, GMde Jesus, RYuan, AGhai, RDMcMartin, CBohacek, R Meta-substituted benzofused macrocyclic lactams as zinc metalloprotease inhibitors. J Med Chem40:506-14 (1997) 
 
Thermolysin
Name:Thermolysin
Type:PROTEIN
Mol. Mass.:60097.54
Organism:Bacillus thermoproteolyticus
Description:ChEMBL_1468794
Residue:548
BDBM50056254
NameBDBM50056254
Synonyms:(6R,9S)-9-Mercaptomethyl-8-oxo-5,6,7,8,9,10,11,12,13,14-decahydro-7-aza-benzocyclododecene-6-carboxylic acid | CHEMBL148140
TypeSmall organic molecule
Emp. Form.C17H23NO3S
Mol. Mass.321.434
SMILESOC(=O)[C@H]1Cc2ccccc2CCCCC[C@H](CS)C(=O)N1