Reaction Details
TargetNeprilysin
LigandBDBM50056247
Substrate/Competitorn/a
Meas. Tech.ChEMBL_144636 (CHEMBL752994)
IC50 7±n/a nM
Citation Ksander, GMde Jesus, RYuan, AGhai, RDMcMartin, CBohacek, R Meta-substituted benzofused macrocyclic lactams as zinc metalloprotease inhibitors. J Med Chem40:506-14 (1997) 
 
Neprilysin
Name:Neprilysin
Type:Enzyme
Mol. Mass.:85505.38
Organism:Homo sapiens (Human)
Description:P08473
Residue:750
BDBM50056247
NameBDBM50056247
Synonyms:(6R,9S)-6-Mercaptomethyl-7-oxo-6,7,8,9,10,11,12,13-octahydro-5H-8-aza-benzocycloundecene-9-carboxylic acid | CHEMBL346424
TypeSmall organic molecule
Emp. Form.C16H21NO3S
Mol. Mass.307.408
SMILESOC(=O)[C@@H]1CCCCc2ccccc2C[C@@H](CS)C(=O)N1