Reaction Details
TargetThermolysin
LigandBDBM50056251
Substrate/Competitorn/a
Meas. Tech.ChEMBL_210397 (CHEMBL814127)
IC50 4000±n/a nM
Citation Ksander, GMde Jesus, RYuan, AGhai, RDMcMartin, CBohacek, R Meta-substituted benzofused macrocyclic lactams as zinc metalloprotease inhibitors. J Med Chem40:506-14 (1997) 
 
Thermolysin
Name:Thermolysin
Type:PROTEIN
Mol. Mass.:60097.54
Organism:Bacillus thermoproteolyticus
Description:ChEMBL_1468794
Residue:548
BDBM50056251
NameBDBM50056251
Synonyms:(6R,9S)-6-Mercaptomethyl-7-oxo-5,6,7,8,9,10,11,12,13,14-decahydro-8-aza-benzocyclododecene-9-carboxylic acid | CHEMBL357311
TypeSmall organic molecule
Emp. Form.C17H23NO3S
Mol. Mass.321.434
SMILESOC(=O)[C@@H]1CCCCCc2ccccc2C[C@@H](CS)C(=O)N1