Reaction Details
Target5-hydroxytryptamine receptor 1A
LigandBDBM81993
Substrate/Competitorn/a
Meas. Tech.ChEMBL_1548 (CHEMBL616370)
Ki 24±n/a nM
Citation Heier, RFDolak, LADuncan, JNHyslop, DKLipton, MFMartin, IJMauragis, MAPiercey, MFNichols, NFSchreur, PJSmith, MWMoon, MW Synthesis and biological activities of (R)-5,6-dihydro-N,N-dimethyl-4H-imidazo[4,5,1-ij]quinolin-5-amine and its metabolites. J Med Chem40:639-46 (1997) 
 
5-hydroxytryptamine receptor 1A
Name:5-hydroxytryptamine receptor 1A
Type:n/a
Mol. Mass.:46122.49
Organism:Homo sapiens (Human)
Description:n/a
Residue:422
BDBM81993
NameBDBM81993
Synonyms:BROMOCRIPTINE Bromocriptine+ (GTP-)
Typen/a
Emp. Form.C32H40BrN5O5
Mol. Mass.654.594
SMILESCC(C)C[C@@H]1N2C(=O)[C@](NC(=O)[C@H]3CN(C)[C@@H]4Cc5c(Br)[nH]c6cccc(C4=C3)c56)(O[C@@]2(O)[C@@H]2CCCN2C1=O)C(C)C