Reaction Details
TargetThymidylate synthase
LigandBDBM50056518
Substrate/Competitorn/a
Meas. Tech.ChEMBL_208944 (CHEMBL814563)
Ki 54±n/a nM
Citation Jones, TRWebber, SEVarney, MDReddy, MRLewis, KKKathardekar, VMazdiyasni, HDeal, JNguyen, DWelsh, KMWebber, SJohnston, AMatthews, DASmith, WWJanson, CABacquet, RJHowland, EFBooth, CLHerrmann, SMWard, RWWhite, JBartlett, CAMorse, CA Structure-based design of substituted diphenyl sulfones and sulfoxides as lipophilic inhibitors of thymidylate synthase. J Med Chem40:677-83 (1997) 
 
Thymidylate synthase
Name:Thymidylate synthase
Type:Enzyme
Mol. Mass.:35718.07
Organism:Homo sapiens (Human)
Description:n/a
Residue:313
BDBM50056518
NameBDBM50056518
Synonyms:6-{[(4-Benzenesulfinyl-3-chloro-phenyl)-prop-2-ynyl-amino]-methyl}-2-methyl-3H-quinazolin-4-one | CHEMBL160215
TypeSmall organic molecule
Emp. Form.C25H20ClN3O2S
Mol. Mass.461.963
SMILESCc1nc2ccc(CN(CC#C)c3ccc(c(Cl)c3)S(=O)c3ccccc3)cc2c(=O)[nH]1