Reaction Details
TargetThymidylate synthase
LigandBDBM50056524
Substrate/Competitorn/a
Meas. Tech.ChEMBL_209646 (CHEMBL811587)
Ki 260±n/a nM
Citation Jones, TRWebber, SEVarney, MDReddy, MRLewis, KKKathardekar, VMazdiyasni, HDeal, JNguyen, DWelsh, KMWebber, SJohnston, AMatthews, DASmith, WWJanson, CABacquet, RJHowland, EFBooth, CLHerrmann, SMWard, RWWhite, JBartlett, CAMorse, CA Structure-based design of substituted diphenyl sulfones and sulfoxides as lipophilic inhibitors of thymidylate synthase. J Med Chem40:677-83 (1997) 
 
Thymidylate synthase
Name:Thymidylate synthase
Type:Enzyme
Mol. Mass.:35718.07
Organism:Homo sapiens (Human)
Description:n/a
Residue:313
BDBM50056524
NameBDBM50056524
Synonyms:2-Methyl-6-({prop-2-ynyl-[4-(toluene-2-sulfinyl)-3-trifluoromethyl-phenyl]-amino}-methyl)-3H-quinazolin-4-one | CHEMBL157702
TypeSmall organic molecule
Emp. Form.C27H22F3N3O2S
Mol. Mass.509.543
SMILESCc1nc2ccc(CN(CC#C)c3ccc(c(c3)C(F)(F)F)S(=O)c3ccccc3C)cc2c(=O)[nH]1