Reaction Details
TargetThymidylate synthase
LigandBDBM50056522
Substrate/Competitorn/a
Meas. Tech.ChEMBL_209646 (CHEMBL811587)
Ki 70.0±n/a nM
Citation Jones, TRWebber, SEVarney, MDReddy, MRLewis, KKKathardekar, VMazdiyasni, HDeal, JNguyen, DWelsh, KMWebber, SJohnston, AMatthews, DASmith, WWJanson, CABacquet, RJHowland, EFBooth, CLHerrmann, SMWard, RWWhite, JBartlett, CAMorse, CA Structure-based design of substituted diphenyl sulfones and sulfoxides as lipophilic inhibitors of thymidylate synthase. J Med Chem40:677-83 (1997) 
 
Thymidylate synthase
Name:Thymidylate synthase
Type:Enzyme
Mol. Mass.:35718.07
Organism:Homo sapiens (Human)
Description:n/a
Residue:313
BDBM50056522
NameBDBM50056522
Synonyms:6-{[(4-Benzenesulfinyl-3-trifluoromethyl-phenyl)-prop-2-ynyl-amino]-methyl}-2-methyl-3H-quinazolin-4-one | CHEMBL161450
TypeSmall organic molecule
Emp. Form.C26H20F3N3O2S
Mol. Mass.495.516
SMILESCc1nc2ccc(CN(CC#C)c3ccc(c(c3)C(F)(F)F)S(=O)c3ccccc3)cc2c(=O)[nH]1