Reaction Details
TargetSodium-dependent dopamine transporter
LigandBDBM22165
Substrate/Competitorn/a
Meas. Tech.ChEMBL_52731 (CHEMBL663149)
IC50 1.8±n/a nM
Citation Matecka, DLewis, DRothman, RBDersch, CMWojnicki, FHGlowa, JRDeVries, ACPert, ARice, KC Heteroaromatic analogs of 1-[2-(diphenylmethoxy)ethyl]- and 1-[2-[bis(4-fluorophenyl)methoxy]ethyl]-4-(3-phenylpropyl)piperazines (GBR 12935 and GBR 12909) as high-affinity dopamine reuptake inhibitors. J Med Chem40:705-16 (1997) 
 
Sodium-dependent dopamine transporter
Name:Sodium-dependent dopamine transporter
Type:Multi-pass membrane protein
Mol. Mass.:68749.45
Organism:Rattus norvegicus (rat)
Description:P23977
Residue:619
BDBM22165
NameBDBM22165
Synonyms:1-{2-[bis(4-fluorophenyl)methoxy]ethyl}-4-(3-phenylpropyl)piperazine CHEMBL281594 CHEMBL543876 GBR-12909 US9944618, Compound ID No. 175 | Vanoxerine
TypeSmall organic molecule
Emp. Form.C28H32F2N2O
Mol. Mass.450.5633
SMILESFc1ccc(cc1)C(OCCN1CCN(CCCc2ccccc2)CC1)c1ccc(F)cc1