Reaction Details
TargetOxytocin receptor
LigandBDBM50056796
Substrate/Competitorn/a
Meas. Tech.ChEMBL_149174 (CHEMBL762089)
Ki 0.9±n/a nM
Citation Chen, LZoulíková, ISlaninová, JBarany, G Synthesis and pharmacology of novel analogues of oxytocin and deaminooxytocin: directed methods for the construction of disulfide and trisulfide bridges in peptides. J Med Chem40:864-76 (1997) 
 
Oxytocin receptor
Name:Oxytocin receptor
Type:Enzyme Catalytic Domain
Mol. Mass.:42889.28
Organism:RAT
Description:Oxytocin OXTR RAT::P70536
Residue:388
BDBM50056796
NameBDBM50056796
Synonyms:CHEMBL435716 | DEAMINOOXYTOCIN
TypeSmall organic molecule
Emp. Form.C43H65N11O12S2
Mol. Mass.992.173
SMILESCC[C@H](C)[C@@H]1NC(=O)[C@H](Cc2ccc(O)cc2)NC(=O)CCSSC[C@@H](NC(=O)[C@H](CC(N)=O)NC(=O)[C@H](CCC(N)=O)NC1=O)C(=O)N1CCC[C@H]1C(=O)N[C@@H](CC(C)C)C(=O)NCC(N)=O