Reaction Details
TargetProstaglandin G/H synthase 1
LigandBDBM50057000
Substrate/Competitorn/a
Meas. Tech.ChEMBL_158726 (CHEMBL768734)
IC50 140±n/a nM
Citation Lazer, ESMiao, CKCywin, CLSorcek, RWong, HCMeng, ZPotocki, IHoermann, MSnow, RJTschantz, MAKelly, TAMcNeil, DWCoutts, SJChurchill, LGraham, AGDavid, EGrob, PMEngel, WMeier, HTrummlitz, G Effect of structural modification of enol-carboxamide-type nonsteroidal antiinflammatory drugs on COX-2/COX-1 selectivity. J Med Chem40:980-9 (1997) 
 
Prostaglandin G/H synthase 1
Name:Prostaglandin G/H synthase 1
Type:Enzyme
Mol. Mass.:68692.62
Organism:Homo sapiens (Human)
Description:P23219
Residue:599
BDBM50057000
NameBDBM50057000
Synonyms:6-Chloro-3-hydroxy-2-methyl-1,1-dioxo-1,2-dihydro-1lambda*6*-benzo[e][1,2]thiazine-4-carboxylic acid (2,4-dibromo-phenyl)-amide | CHEMBL173724
TypeSmall organic molecule
Emp. Form.C16H11Br2ClN2O4S
Mol. Mass.522.596
SMILESCN1C(=O)C(C(=O)Nc2ccc(Br)cc2Br)c2cc(Cl)ccc2S1(=O)=O