Reaction Details
TargetProstaglandin G/H synthase 1
LigandBDBM50057006
Substrate/Competitorn/a
Meas. Tech.ChEMBL_158726 (CHEMBL768734)
IC50 370±n/a nM
Citation Lazer, ESMiao, CKCywin, CLSorcek, RWong, HCMeng, ZPotocki, IHoermann, MSnow, RJTschantz, MAKelly, TAMcNeil, DWCoutts, SJChurchill, LGraham, AGDavid, EGrob, PMEngel, WMeier, HTrummlitz, G Effect of structural modification of enol-carboxamide-type nonsteroidal antiinflammatory drugs on COX-2/COX-1 selectivity. J Med Chem40:980-9 (1997) 
 
Prostaglandin G/H synthase 1
Name:Prostaglandin G/H synthase 1
Type:Enzyme
Mol. Mass.:68692.62
Organism:Homo sapiens (Human)
Description:P23219
Residue:599
BDBM50057006
NameBDBM50057006
Synonyms:3-Hydroxy-2-methyl-1-oxo-1,2-dihydro-isoquinoline-4-carboxylic acid phenylamide | CHEMBL368468
TypeSmall organic molecule
Emp. Form.C17H14N2O3
Mol. Mass.294.3047
SMILESCN1C(=O)C(C(=O)Nc2ccccc2)c2ccccc2C1=O