Reaction Details
TargetProstaglandin G/H synthase 2
LigandBDBM50029616
Substrate/Competitorn/a
Meas. Tech.ChEMBL_159901 (CHEMBL768683)
IC50 90±n/a nM
Citation Lazer, ESMiao, CKCywin, CLSorcek, RWong, HCMeng, ZPotocki, IHoermann, MSnow, RJTschantz, MAKelly, TAMcNeil, DWCoutts, SJChurchill, LGraham, AGDavid, EGrob, PMEngel, WMeier, HTrummlitz, G Effect of structural modification of enol-carboxamide-type nonsteroidal antiinflammatory drugs on COX-2/COX-1 selectivity. J Med Chem40:980-9 (1997) 
 
Prostaglandin G/H synthase 2
Name:Prostaglandin G/H synthase 2
Type:Enzyme
Mol. Mass.:69003.89
Organism:Homo sapiens (Human)
Description:Recombinant Cox-2 provided by Cayman (Cayman Chemical Co.,Ann Arbor, MI).
Residue:604
BDBM50029616
NameBDBM50029616
Synonyms:5-(4-Fluoro-phenyl)-1-(4-methanesulfonyl-phenyl)-3-trifluoromethyl-1H-pyrazole CHEMBL274990 SC58125
TypeSmall organic molecule
Emp. Form.C17H12F4N2O2S
Mol. Mass.384.348
SMILESCS(=O)(=O)c1ccc(cc1)-n1nc(cc1-c1ccc(F)cc1)C(F)(F)F