Reaction Details
TargetProstaglandin G/H synthase 2
LigandBDBM50057005
Substrate/Competitorn/a
Meas. Tech.ChEMBL_159741 (CHEMBL762905)
IC50 200±n/a nM
Citation Lazer, ESMiao, CKCywin, CLSorcek, RWong, HCMeng, ZPotocki, IHoermann, MSnow, RJTschantz, MAKelly, TAMcNeil, DWCoutts, SJChurchill, LGraham, AGDavid, EGrob, PMEngel, WMeier, HTrummlitz, G Effect of structural modification of enol-carboxamide-type nonsteroidal antiinflammatory drugs on COX-2/COX-1 selectivity. J Med Chem40:980-9 (1997) 
 
Prostaglandin G/H synthase 2
Name:Prostaglandin G/H synthase 2
Type:Enzyme
Mol. Mass.:69003.89
Organism:Homo sapiens (Human)
Description:Recombinant Cox-2 provided by Cayman (Cayman Chemical Co.,Ann Arbor, MI).
Residue:604
BDBM50057005
NameBDBM50057005
Synonyms:6-Chloro-3-hydroxy-2-methyl-1-oxo-1,2-dihydro-isoquinoline-4-carboxylic acid (2,4-dichloro-phenyl)-amide | CHEMBL177808
TypeSmall organic molecule
Emp. Form.C17H11Cl3N2O3
Mol. Mass.397.64
SMILESCN1C(=O)C(C(=O)Nc2ccc(Cl)cc2Cl)c2cc(Cl)ccc2C1=O