Reaction Details
TargetProstaglandin G/H synthase 2
LigandBDBM50056998
Substrate/Competitorn/a
Meas. Tech.ChEMBL_159739 (CHEMBL762903)
IC50 490.0±n/a nM
Citation Lazer, ESMiao, CKCywin, CLSorcek, RWong, HCMeng, ZPotocki, IHoermann, MSnow, RJTschantz, MAKelly, TAMcNeil, DWCoutts, SJChurchill, LGraham, AGDavid, EGrob, PMEngel, WMeier, HTrummlitz, G Effect of structural modification of enol-carboxamide-type nonsteroidal antiinflammatory drugs on COX-2/COX-1 selectivity. J Med Chem40:980-9 (1997) 
 
Prostaglandin G/H synthase 2
Name:Prostaglandin G/H synthase 2
Type:Enzyme
Mol. Mass.:69003.89
Organism:Homo sapiens (Human)
Description:Recombinant Cox-2 provided by Cayman (Cayman Chemical Co.,Ann Arbor, MI).
Residue:604
BDBM50056998
NameBDBM50056998
Synonyms:4-Hydroxy-1,1-dioxo-1,2-dihydro-1lambda*6*-benzo[e][1,2]thiazine-3-carboxylic acid (5-methyl-thiazol-2-yl)-amide CHEMBL599 Meloxicam sodium UH-AC 62XX | UHAC-62XX
TypeSmall organic molecule
Emp. Form.C14H13N3O4S2
Mol. Mass.351.401
SMILESCN1C(C(=O)Nc2ncc(C)s2)=C(O)c2ccccc2S1(=O)=O