Reaction Details
TargetReverse transcriptase/RNaseH
LigandBDBM50002662
Substrate/Competitorn/a
Meas. Tech.ChEMBL_197278 (CHEMBL804265)
EC50 320±n/a nM
Citation Zembower, DELiao, SFlavin, MTXu, ZQStup, TLBuckheit, RWKhilevich, AMar, AASheinkman, AK Structural analogues of the calanolide anti-HIV agents. Modification of the trans-10,11-dimethyldihydropyran-12-ol ring (ring C). J Med Chem40:1005-17 (1997) 
 
Reverse transcriptase/RNaseH
Name:Reverse transcriptase/RNaseH
Type:PROTEIN
Mol. Mass.:65229.15
Organism:Human immunodeficiency virus 1
Description:ChEMBL_1473730
Residue:566
BDBM50002662
NameBDBM50002662
Synonyms:(+)-calanolide A (10R,11S,12S)-12-Hydroxy-6,6,10,11-tetramethyl-4-propyl-11,12-dihydro-6H,10H-dipyrano[2,3-f;2',3'-h]chromen-2-one CHEMBL267447 | cid_1201
TypeSmall organic molecule
Emp. Form.C22H26O5
Mol. Mass.370.4388
SMILESCCCc1cc(=O)oc2c3[C@@H](O)[C@H](C)[C@@H](C)Oc3c3C=CC(C)(C)Oc3c12