Reaction Details
TargetReverse transcriptase/RNaseH
LigandBDBM50054452
Substrate/Competitorn/a
Meas. Tech.ChEMBL_197278 (CHEMBL804265)
EC50 40000±n/a nM
Citation Zembower, DELiao, SFlavin, MTXu, ZQStup, TLBuckheit, RWKhilevich, AMar, AASheinkman, AK Structural analogues of the calanolide anti-HIV agents. Modification of the trans-10,11-dimethyldihydropyran-12-ol ring (ring C). J Med Chem40:1005-17 (1997) 
 
Reverse transcriptase/RNaseH
Name:Reverse transcriptase/RNaseH
Type:PROTEIN
Mol. Mass.:65229.15
Organism:Human immunodeficiency virus 1
Description:ChEMBL_1473730
Residue:566
BDBM50054452
NameBDBM50054452
Synonyms:(10R,11R)-6,6,10,11-Tetramethyl-4-propyl-10,11-dihydro-6H-dipyrano[2,3-f;2',3'-h]chromene-2,12-dione | CHEMBL269090
TypeSmall organic molecule
Emp. Form.C22H24O5
Mol. Mass.368.423
SMILESCCCc1cc(=O)oc2c3C(=O)[C@H](C)[C@@H](C)Oc3c3C=CC(C)(C)Oc3c12