Reaction Details
TargetStromelysin-1
LigandBDBM50057039
Substrate/Competitorn/a
Meas. Tech.ChEMBL_104738 (CHEMBL710738)
Ki 11±n/a nM
Citation Esser, CKBugianesi, RLCaldwell, CGChapman, KTDurette, PLGirotra, NNKopka, IELanza, TJLevorse, DAMacCoss, MOwens, KAPonpipom, MMSimeone, JPHarrison, RKNiedzwiecki, LBecker, JWMarcy, AIAxel, MGChristen, AJMcDonnell, JMoore, VLOlszewski, JMSaphos, CVisco, DMHagmann, WK Inhibition of stromelysin-1 (MMP-3) by P1'-biphenylylethyl carboxyalkyl dipeptides. J Med Chem40:1026-40 (1997) 
 
Stromelysin-1
Name:Stromelysin-1
Type:Enzyme
Mol. Mass.:53973.13
Organism:Homo sapiens (Human)
Description: P08254
Residue:477
BDBM50057039
NameBDBM50057039
Synonyms:(2S,4R)-6-(4'-Bromo-biphenyl-4-yl)-2-butyl-4-((S)-2,2-dimethyl-1-methylcarbamoyl-propylcarbamoyl)-hexanoic acid | CHEMBL8753
TypeSmall organic molecule
Emp. Form.C30H41BrN2O4
Mol. Mass.573.562
SMILESCCCC[C@@H](C[C@@H](CCc1ccc(cc1)-c1ccc(Br)cc1)C(=O)N[C@H](C(=O)NC)C(C)(C)C)C(O)=O