Reaction Details
Target72 kDa type IV collagenase
LigandBDBM50057052
Substrate/Competitorn/a
Meas. Tech.ChEMBL_104543 (CHEMBL718930)
Ki 16±n/a nM
Citation Esser, CKBugianesi, RLCaldwell, CGChapman, KTDurette, PLGirotra, NNKopka, IELanza, TJLevorse, DAMacCoss, MOwens, KAPonpipom, MMSimeone, JPHarrison, RKNiedzwiecki, LBecker, JWMarcy, AIAxel, MGChristen, AJMcDonnell, JMoore, VLOlszewski, JMSaphos, CVisco, DMHagmann, WK Inhibition of stromelysin-1 (MMP-3) by P1'-biphenylylethyl carboxyalkyl dipeptides. J Med Chem40:1026-40 (1997) 
 
72 kDa type IV collagenase
Name:72 kDa type IV collagenase
Type:Enzyme
Mol. Mass.:73870.36
Organism:Homo sapiens (Human)
Description: P08253
Residue:660
BDBM50057052
NameBDBM50057052
Synonyms:(2S,4R)-6-(4-Benzyl-phenyl)-2-butyl-4-((S)-2,2-dimethyl-1-phenylcarbamoyl-propylcarbamoyl)-hexanoic acid | CHEMBL6216
TypeSmall organic molecule
Emp. Form.C36H46N2O4
Mol. Mass.570.7614
SMILESCCCC[C@@H](C[C@@H](CCc1ccc(Cc2ccccc2)cc1)C(=O)N[C@H](C(=O)Nc1ccccc1)C(C)(C)C)C(O)=O