Reaction Details
Target72 kDa type IV collagenase
LigandBDBM50057065
Substrate/Competitorn/a
Meas. Tech.ChEMBL_104543 (CHEMBL718930)
Ki 19±n/a nM
Citation Esser, CKBugianesi, RLCaldwell, CGChapman, KTDurette, PLGirotra, NNKopka, IELanza, TJLevorse, DAMacCoss, MOwens, KAPonpipom, MMSimeone, JPHarrison, RKNiedzwiecki, LBecker, JWMarcy, AIAxel, MGChristen, AJMcDonnell, JMoore, VLOlszewski, JMSaphos, CVisco, DMHagmann, WK Inhibition of stromelysin-1 (MMP-3) by P1'-biphenylylethyl carboxyalkyl dipeptides. J Med Chem40:1026-40 (1997) 
 
72 kDa type IV collagenase
Name:72 kDa type IV collagenase
Type:Enzyme
Mol. Mass.:73870.36
Organism:Homo sapiens (Human)
Description: P08253
Residue:660
BDBM50057065
NameBDBM50057065
Synonyms:(2S,4R)-2-Butyl-4-((S)-2,2-dimethyl-1-methylcarbamoyl-propylcarbamoyl)-6-(4'-methanesulfonyl-biphenyl-4-yl)-hexanoic acid | CHEMBL8761
TypeSmall organic molecule
Emp. Form.C31H44N2O6S
Mol. Mass.572.756
SMILESCCCC[C@@H](C[C@@H](CCc1ccc(cc1)-c1ccc(cc1)S(C)(=O)=O)C(=O)N[C@H](C(=O)NC)C(C)(C)C)C(O)=O