Reaction Details
TargetStromelysin-1
LigandBDBM50057050
Substrate/Competitorn/a
Meas. Tech.ChEMBL_104738 (CHEMBL710738)
Ki 2±n/a nM
Citation Esser, CKBugianesi, RLCaldwell, CGChapman, KTDurette, PLGirotra, NNKopka, IELanza, TJLevorse, DAMacCoss, MOwens, KAPonpipom, MMSimeone, JPHarrison, RKNiedzwiecki, LBecker, JWMarcy, AIAxel, MGChristen, AJMcDonnell, JMoore, VLOlszewski, JMSaphos, CVisco, DMHagmann, WK Inhibition of stromelysin-1 (MMP-3) by P1'-biphenylylethyl carboxyalkyl dipeptides. J Med Chem40:1026-40 (1997) 
 
Stromelysin-1
Name:Stromelysin-1
Type:Enzyme
Mol. Mass.:53973.13
Organism:Homo sapiens (Human)
Description: P08254
Residue:477
BDBM50057050
NameBDBM50057050
Synonyms:(2S,4R)-2-Butyl-4-[(S)-2,2-dimethyl-1-(pyridin-4-ylcarbamoyl)-propylcarbamoyl]-6-(4'-fluoro-biphenyl-4-yl)-hexanoic acid | CHEMBL267533
TypeSmall organic molecule
Emp. Form.C34H42FN3O4
Mol. Mass.575.7134
SMILESCCCC[C@@H](C[C@@H](CCc1ccc(cc1)-c1ccc(F)cc1)C(=O)N[C@H](C(=O)Nc1ccncc1)C(C)(C)C)C(O)=O