Reaction Details
Target72 kDa type IV collagenase
LigandBDBM50057072
Substrate/Competitorn/a
Meas. Tech.ChEMBL_104543 (CHEMBL718930)
Ki 80±n/a nM
Citation Esser, CKBugianesi, RLCaldwell, CGChapman, KTDurette, PLGirotra, NNKopka, IELanza, TJLevorse, DAMacCoss, MOwens, KAPonpipom, MMSimeone, JPHarrison, RKNiedzwiecki, LBecker, JWMarcy, AIAxel, MGChristen, AJMcDonnell, JMoore, VLOlszewski, JMSaphos, CVisco, DMHagmann, WK Inhibition of stromelysin-1 (MMP-3) by P1'-biphenylylethyl carboxyalkyl dipeptides. J Med Chem40:1026-40 (1997) 
 
72 kDa type IV collagenase
Name:72 kDa type IV collagenase
Type:Enzyme
Mol. Mass.:73870.36
Organism:Homo sapiens (Human)
Description: P08253
Residue:660
BDBM50057072
NameBDBM50057072
Synonyms:(2S,4R)-2-Butyl-6-(3'-chloro-4'-fluoro-biphenyl-4-yl)-4-((S)-2,2-dimethyl-1-methylcarbamoyl-propylcarbamoyl)-hexanoic acid | CHEMBL8833
TypeSmall organic molecule
Emp. Form.C30H40ClFN2O4
Mol. Mass.547.101
SMILESCCCC[C@@H](C[C@@H](CCc1ccc(cc1)-c1ccc(F)c(Cl)c1)C(=O)N[C@H](C(=O)NC)C(C)(C)C)C(O)=O