Reaction Details
TargetEndothelin receptor type B
LigandBDBM50034267
Substrate/Competitorn/a
Meas. Tech.ChEMBL_63527 (CHEMBL677440)
IC50 780±n/a nM
Citation Patt, WCEdmunds, JJRepine, JTBerryman, KAReisdorph, BRLee, CPlummer, MSShahripour, AHaleen, SJKeiser, JAFlynn, MAWelch, KMReynolds, EERubin, RTobias, BHallak, HDoherty, AM Structure-activity relationships in a series of orally active gamma-hydroxy butenolide endothelin antagonists. J Med Chem40:1063-74 (1997) 
 
Endothelin receptor type B
Name:Endothelin receptor type B
Type:Enzyme Catalytic Domain
Mol. Mass.:49664.00
Organism:Homo sapiens (Human)
Description:ENDOTHELIN B EDNRB HUMAN::P24530
Residue:442
BDBM50034267
NameBDBM50034267
Synonyms:3-(benzo[d][1,3]dioxol-5-yl)-5-hydroxy-5-(4-methoxyphenyl)-4-(3,4,5-trimethoxybenzyl)furan-2(5H)-one CHEMBL8981 PD156707
TypeSmall organic molecule
Emp. Form.C28H26O9
Mol. Mass.506.5006
SMILESCOc1ccc(cc1)C1(O)OC(=O)C(=C1Cc1cc(OC)c(OC)c(OC)c1)c1ccc2OCOc2c1