Reaction Details
TargetEndothelin-1 receptor
LigandBDBM50057169
Substrate/Competitorn/a
Meas. Tech.ChEMBL_65465 (CHEMBL682105)
IC50 0.12±n/a nM
Citation Patt, WCEdmunds, JJRepine, JTBerryman, KAReisdorph, BRLee, CPlummer, MSShahripour, AHaleen, SJKeiser, JAFlynn, MAWelch, KMReynolds, EERubin, RTobias, BHallak, HDoherty, AM Structure-activity relationships in a series of orally active gamma-hydroxy butenolide endothelin antagonists. J Med Chem40:1063-74 (1997) 
 
Endothelin-1 receptor
Name:Endothelin-1 receptor
Type:Enzyme Catalytic Domain
Mol. Mass.:48736.88
Organism:Homo sapiens (Human)
Description:P25101
Residue:427
BDBM50057169
NameBDBM50057169
Synonyms:3-Benzo[1,3]dioxol-5-yl-5-hydroxy-5-(4-methoxy-phenyl)-4-(3,4,5-triethoxy-benzyl)-5H-furan-2-one | CHEMBL417067
TypeSmall organic molecule
Emp. Form.C31H32O9
Mol. Mass.548.5804
SMILESCCOc1cc(CC2=C(C(=O)OC2(O)c2ccc(OC)cc2)c2ccc3OCOc3c2)cc(OCC)c1OCC