Reaction Details
TargetEndothelin-1 receptor
LigandBDBM50057202
Substrate/Competitorn/a
Meas. Tech.ChEMBL_65465 (CHEMBL682105)
IC50 0.5±n/a nM
Citation Patt, WCEdmunds, JJRepine, JTBerryman, KAReisdorph, BRLee, CPlummer, MSShahripour, AHaleen, SJKeiser, JAFlynn, MAWelch, KMReynolds, EERubin, RTobias, BHallak, HDoherty, AM Structure-activity relationships in a series of orally active gamma-hydroxy butenolide endothelin antagonists. J Med Chem40:1063-74 (1997) 
 
Endothelin-1 receptor
Name:Endothelin-1 receptor
Type:Enzyme Catalytic Domain
Mol. Mass.:48736.88
Organism:Homo sapiens (Human)
Description:P25101
Residue:427
BDBM50057202
NameBDBM50057202
Synonyms:3-Benzo[1,3]dioxol-5-yl-5-hydroxy-5-(4-methoxy-3-methyl-phenyl)-4-(3,4,5-trimethoxy-benzyl)-5H-furan-2-one | CHEMBL11369
TypeSmall organic molecule
Emp. Form.C29H28O9
Mol. Mass.520.5272
SMILESCOc1ccc(cc1C)C1(O)OC(=O)C(=C1Cc1cc(OC)c(OC)c(OC)c1)c1ccc2OCOc2c1