Reaction Details
TargetEndothelin-1 receptor
LigandBDBM50057154
Substrate/Competitorn/a
Meas. Tech.ChEMBL_65465 (CHEMBL682105)
IC50 1.2±n/a nM
Citation Patt, WCEdmunds, JJRepine, JTBerryman, KAReisdorph, BRLee, CPlummer, MSShahripour, AHaleen, SJKeiser, JAFlynn, MAWelch, KMReynolds, EERubin, RTobias, BHallak, HDoherty, AM Structure-activity relationships in a series of orally active gamma-hydroxy butenolide endothelin antagonists. J Med Chem40:1063-74 (1997) 
 
Endothelin-1 receptor
Name:Endothelin-1 receptor
Type:Enzyme Catalytic Domain
Mol. Mass.:48736.88
Organism:Homo sapiens (Human)
Description:P25101
Residue:427
BDBM50057154
NameBDBM50057154
Synonyms:CHEMBL10697 | N-{4-[4-Benzo[1,3]dioxol-5-yl-2-hydroxy-2-(4-methoxy-phenyl)-5-oxo-2,5-dihydro-furan-3-ylmethyl]-phenyl}-acetamide
TypeSmall organic molecule
Emp. Form.C27H23NO7
Mol. Mass.473.474
SMILESCOc1ccc(cc1)C1(O)OC(=O)C(=C1Cc1ccc(NC(C)=O)cc1)c1ccc2OCOc2c1