Reaction Details
TargetEndothelin-1 receptor
LigandBDBM50057189
Substrate/Competitorn/a
Meas. Tech.ChEMBL_65465 (CHEMBL682105)
IC50 0.9±n/a nM
Citation Patt, WCEdmunds, JJRepine, JTBerryman, KAReisdorph, BRLee, CPlummer, MSShahripour, AHaleen, SJKeiser, JAFlynn, MAWelch, KMReynolds, EERubin, RTobias, BHallak, HDoherty, AM Structure-activity relationships in a series of orally active gamma-hydroxy butenolide endothelin antagonists. J Med Chem40:1063-74 (1997) 
 
Endothelin-1 receptor
Name:Endothelin-1 receptor
Type:Enzyme Catalytic Domain
Mol. Mass.:48736.88
Organism:Homo sapiens (Human)
Description:P25101
Residue:427
BDBM50057189
NameBDBM50057189
Synonyms:5-Hydroxy-3-(7-methoxy-benzo[1,3]dioxol-5-yl)-5-(4-methoxy-3-methyl-phenyl)-4-(3,4,5-trimethoxy-benzyl)-5H-furan-2-one | CHEMBL10854
TypeSmall organic molecule
Emp. Form.C30H30O10
Mol. Mass.550.5532
SMILESCOc1cc(cc2OCOc12)C1=C(Cc2cc(OC)c(OC)c(OC)c2)C(O)(OC1=O)c1ccc(OC)c(C)c1