Reaction Details
TargetMu-type opioid receptor
LigandBDBM50057381
Substrate/Competitorn/a
Meas. Tech.ChEMBL_145162 (CHEMBL753422)
Ki 62±n/a nM
Citation Arttamangkul, SIshmael, JEMurray, TFGrandy, DKDeLander, GEKieffer, BLAldrich, JV Synthesis and opioid activity of conformationally constrained dynorphin A analogues. 2. Conformational constraint in the"address" sequence. J Med Chem40:1211-8 (1997) 
 
Mu-type opioid receptor
Name:Mu-type opioid receptor
Type:Enzyme Catalytic Domain
Mol. Mass.:11165.58
Organism:GUINEA PIG
Description:P97266
Residue:98
BDBM50057381
NameBDBM50057381
Synonyms:Analog of Dynorphin A | CHEMBL414921
TypeSmall organic molecule
Emp. Form.C72H117N25O16
Mol. Mass.1588.8573
SMILESCC(C)C[C@H](NC(=O)[C@H](CCCCN)NC(=O)[C@@H]1CCCN1C(=O)[C@H](CCCNC(N)=N)NC(=O)[C@H]1CCCNC(=O)[C@H](CCCNC(N)=N)NC(=O)[C@@H](CCCNC(N)=N)NC(=O)[C@@H](CC(=O)N1)NC(=O)[C@H](Cc1ccccc1)NC(=O)CNC(=O)CNC(=O)[C@@H](N)Cc1ccc(O)cc1)C(=O)N[C@@H](CCCCN)C(O)=O