Reaction Details
TargetNitroreductase NfsA
LigandBDBM50057437
Substrate/Competitorn/a
Meas. Tech.ChEMBL_206006 (CHEMBL840569)
IC50 190±n/a nM
Citation Friedlos, FDenny, WAPalmer, BDSpringer, CJ Mustard prodrugs for activation by Escherichia coli nitroreductase in gene-directed enzyme prodrug therapy. J Med Chem40:1270-5 (1997) 
 
Nitroreductase NfsA
Name:Nitroreductase NfsA
Synonyms:Modulator of drug activity A
Type:PROTEIN
Mol. Mass.:26851.30
Organism:Escherichia coli O157:H7
Description:ChEMBL_206006
Residue:240
BDBM50057437
NameBDBM50057437
TypeSmall organic molecule
Emp. Form.C11H12Br2N4O5
Mol. Mass.440.045
SMILESNC(=O)c1cc(cc(c1N(CCBr)CCBr)[N+]([O-])=O)[N+]([O-])=O