Reaction Details
TargetNitroreductase NfsA
LigandBDBM50057439
Substrate/Competitorn/a
Meas. Tech.ChEMBL_206006 (CHEMBL840569)
IC50 207000±n/a nM
Citation Friedlos, FDenny, WAPalmer, BDSpringer, CJ Mustard prodrugs for activation by Escherichia coli nitroreductase in gene-directed enzyme prodrug therapy. J Med Chem40:1270-5 (1997) 
 
Nitroreductase NfsA
Name:Nitroreductase NfsA
Synonyms:Modulator of drug activity A
Type:PROTEIN
Mol. Mass.:26851.30
Organism:Escherichia coli O157:H7
Description:ChEMBL_206006
Residue:240
BDBM50057439
NameBDBM50057439
TypeSmall organic molecule
Emp. Form.C7H9Cl2N3O2S
Mol. Mass.270.136
SMILES[O-][N+](=O)c1cnc(s1)N(CCCl)CCCl