Reaction Details
TargetProstaglandin G/H synthase 1
LigandBDBM50057527
Substrate/Competitorn/a
Meas. Tech.ChEMBL_158753 (CHEMBL772766)
IC50 17800±n/a nM
Citation Penning, TDTalley, JJBertenshaw, SRCarter, JSCollins, PWDocter, SGraneto, MJLee, LFMalecha, JWMiyashiro, JMRogers, RSRogier, DJYu, SSAndersonGD, naBurton, EGCogburn, JNGregory, SAKoboldt, CMPerkins, WESeibert, KVeenhuizen, AWZhang, YYIsakson, PC Synthesis and biological evaluation of the 1,5-diarylpyrazole class of cyclooxygenase-2 inhibitors: identification of 4-[5-(4-methylphenyl)-3-(trifluoromethyl)-1H-pyrazol-1-yl]benze nesulfonamide (SC-58635, celecoxib). J Med Chem40:1347-65 (1997) 
 
Prostaglandin G/H synthase 1
Name:Prostaglandin G/H synthase 1
Type:Enzyme
Mol. Mass.:68692.62
Organism:Homo sapiens (Human)
Description:P23219
Residue:599
BDBM50057527
NameBDBM50057527
Synonyms:4-(5-(4-chlorophenyl)-3-(trifluoromethyl)-1H-pyrazol-1-yl)benzenesulfonamide CHEMBL282093 | SC-58236
TypeSmall organic molecule
Emp. Form.C16H11ClF3N3O2S
Mol. Mass.401.791
SMILESNS(=O)(=O)c1ccc(cc1)-n1nc(cc1-c1ccc(Cl)cc1)C(F)(F)F