Reaction Details
TargetReverse transcriptase/RNaseH
LigandBDBM50057809
Substrate/Competitorn/a
Meas. Tech.ChEMBL_197125 (CHEMBL803726)
EC50 500±n/a nM
Citation Adams, DRPerez, CMaillard, MFlorent, JCEvers, MHénin, YLitvak, SLitvak, LMonneret, CGrierson, DS Preparation and anti-HIV activity of N-3-substituted thymidine nucleoside analogs. J Med Chem40:1550-8 (1997) 
 
Reverse transcriptase/RNaseH
Name:Reverse transcriptase/RNaseH
Type:PROTEIN
Mol. Mass.:65229.15
Organism:Human immunodeficiency virus 1
Description:ChEMBL_1473730
Residue:566
BDBM50057809
NameBDBM50057809
Synonyms:3-Amino-1-(4-azido-5-hydroxymethyl-tetrahydro-furan-2-yl)-5-methyl-1H-pyrimidine-2,4-dione | CHEMBL35256
TypeSmall organic molecule
Emp. Form.C10H14N6O4
Mol. Mass.282.256
SMILESCc1cn(C2CC(N=[N+]=[N-])C(CO)O2)c(=O)n(N)c1=O