Reaction Details
TargetReverse transcriptase/RNaseH
LigandBDBM50057819
Substrate/Competitorn/a
Meas. Tech.ChEMBL_197125 (CHEMBL803726)
EC50 1500±n/a nM
Citation Adams, DRPerez, CMaillard, MFlorent, JCEvers, MHénin, YLitvak, SLitvak, LMonneret, CGrierson, DS Preparation and anti-HIV activity of N-3-substituted thymidine nucleoside analogs. J Med Chem40:1550-8 (1997) 
 
Reverse transcriptase/RNaseH
Name:Reverse transcriptase/RNaseH
Type:PROTEIN
Mol. Mass.:65229.15
Organism:Human immunodeficiency virus 1
Description:ChEMBL_1473730
Residue:566
BDBM50057819
NameBDBM50057819
Synonyms:1-(4-Azido-5-hydroxymethyl-tetrahydro-furan-2-yl)-3-(2,2-diethoxy-ethyl)-5-methyl-1H-pyrimidine-2,4-dione | CHEMBL39874
TypeSmall organic molecule
Emp. Form.C16H25N5O6
Mol. Mass.383.3996
SMILESCCOC(Cn1c(=O)c(C)cn(C2CC(N=[N+]=[N-])C(CO)O2)c1=O)OCC