Reaction Details
TargetReverse transcriptase/RNaseH
LigandBDBM50057808
Substrate/Competitorn/a
Meas. Tech.ChEMBL_197125 (CHEMBL803726)
EC50 143000±n/a nM
Citation Adams, DRPerez, CMaillard, MFlorent, JCEvers, MHénin, YLitvak, SLitvak, LMonneret, CGrierson, DS Preparation and anti-HIV activity of N-3-substituted thymidine nucleoside analogs. J Med Chem40:1550-8 (1997) 
 
Reverse transcriptase/RNaseH
Name:Reverse transcriptase/RNaseH
Type:PROTEIN
Mol. Mass.:65229.15
Organism:Human immunodeficiency virus 1
Description:ChEMBL_1473730
Residue:566
BDBM50057808
NameBDBM50057808
Synonyms:1-(4-Azido-5-hydroxymethyl-tetrahydro-furan-2-yl)-3-furan-3-ylmethyl-5-methyl-1H-pyrimidine-2,4-dione | CHEMBL40030
TypeSmall organic molecule
Emp. Form.C15H17N5O5
Mol. Mass.347.326
SMILESCc1cn(C2CC(N=[N+]=[N-])C(CO)O2)c(=O)n(Cc2ccoc2)c1=O