Reaction Details
TargetSerine protease 1
LigandBDBM50057828
Substrate/Competitorn/a
Meas. Tech.ChEMBL_212861 (CHEMBL817813)
Ki 94±n/a nM
Citation Tucker, TJLumma, WCLewis, SDGardell, SJLucas, BJBaskin, EPWoltmann, RLynch, JJLyle, EAAppleby, SDChen, IWDancheck, KBVacca, JP Potent noncovalent thrombin inhibitors that utilize the unique amino acid D-dicyclohexylalanine in the P3 position. Implications on oral bioavailability and antithrombotic efficacy. J Med Chem40:1565-9 (1997) 
 
Serine protease 1
Name:Serine protease 1
Type:Enzyme
Mol. Mass.:26557.80
Organism:Homo sapiens (Human)
Description:P07477
Residue:247
BDBM50057828
NameBDBM50057828
Synonyms:(S)-1-((R)-2-Amino-3,3-diphenyl-propionyl)-pyrrolidine-2-carboxylic acid (4-amino-cyclohexylmethyl)-amide | CHEMBL416795
TypeSmall organic molecule
Emp. Form.C27H36N4O2
Mol. Mass.448.6003
SMILESN[C@H](C(c1ccccc1)c1ccccc1)C(=O)N1CCC[C@H]1C(=O)NCC1CCC(N)CC1