Reaction Details
TargetCoagulation factor X
LigandBDBM50057826
Substrate/Competitorn/a
Meas. Tech.ChEMBL_48818 (CHEMBL661219)
Ki 95000±n/a nM
Citation Tucker, TJLumma, WCLewis, SDGardell, SJLucas, BJBaskin, EPWoltmann, RLynch, JJLyle, EAAppleby, SDChen, IWDancheck, KBVacca, JP Potent noncovalent thrombin inhibitors that utilize the unique amino acid D-dicyclohexylalanine in the P3 position. Implications on oral bioavailability and antithrombotic efficacy. J Med Chem40:1565-9 (1997) 
 
Coagulation factor X
Name:Coagulation factor X
Type:Enzyme
Mol. Mass.:54726.60
Organism:Homo sapiens (Human)
Description:n/a
Residue:488
BDBM50057826
NameBDBM50057826
Synonyms:(S)-1-((R)-2-Amino-3,3-dicyclohexyl-propionyl)-pyrrolidine-2-carboxylic acid (4-amino-cyclohexylmethyl)-amide CHEMBL289395
TypeSmall organic molecule
Emp. Form.C27H48N4O2
Mol. Mass.460.6956
SMILESN[C@H](C(C1CCCCC1)C1CCCCC1)C(=O)N1CCC[C@H]1C(=O)NCC1CCC(N)CC1