Reaction Details
TargetProstaglandin G/H synthase 2
LigandBDBM50057974
Substrate/Competitorn/a
Meas. Tech.ChEMBL_159742 (CHEMBL762906)
IC50 7.0±n/a nM
Citation Khanna, IKWeier, RMYu, YXu, XDKoszyk, FJCollins, PWKoboldt, CMVeenhuizen, AWPerkins, WECasler, JJMasferrer, JLZhang, YYGregory, SASeibert, KIsakson, PC 1,2-Diarylimidazoles as potent, cyclooxygenase-2 selective, and orally active antiinflammatory agents. J Med Chem40:1634-47 (1997) 
 
Prostaglandin G/H synthase 2
Name:Prostaglandin G/H synthase 2
Type:Enzyme
Mol. Mass.:69003.89
Organism:Homo sapiens (Human)
Description:Recombinant Cox-2 provided by Cayman (Cayman Chemical Co.,Ann Arbor, MI).
Residue:604
BDBM50057974
NameBDBM50057974
Synonyms:4-[2-(3-Bromo-phenyl)-4-trifluoromethyl-imidazol-1-yl]-benzenesulfonamide | CHEMBL46584
TypeSmall organic molecule
Emp. Form.C16H11BrF3N3O2S
Mol. Mass.446.242
SMILESNS(=O)(=O)c1ccc(cc1)-n1cc(nc1-c1cccc(Br)c1)C(F)(F)F