Reaction Details
TargetCorticotropin-releasing factor receptor 1
LigandBDBM50058164
Substrate/Competitorn/a
Meas. Tech.ChEMBL_51280 (CHEMBL664982)
IC50 7.6±n/a nM
Citation Chen, YLMansbach, RSWinter, SMBrooks, ECollins, JCorman, MLDunaiskis, ARFaraci, WSGallaschun, RJSchmidt, ASchulz, DW Synthesis and oral efficacy of a 4-(butylethylamino)pyrrolo[2,3-d]pyrimidine: a centrally active corticotropin-releasing factor1 receptor antagonist. J Med Chem40:1749-54 (1997) 
 
Corticotropin-releasing factor receptor 1
Name:Corticotropin-releasing factor receptor 1
Type:G Protein-Coupled Receptor (GPCR)
Mol. Mass.:47870.75
Organism:Rattus norvegicus (rat)
Description:Receptor binding assays were performed using rat cortex homogenate.
Residue:415
BDBM50058164
NameBDBM50058164
Synonyms:But-2-enyl-[2,5-dimethyl-7-(2,4,6-trimethyl-phenyl)-7H-pyrrolo[2,3-d]pyrimidin-4-yl]-ethyl-amine | CHEMBL300935
TypeSmall organic molecule
Emp. Form.C23H30N4
Mol. Mass.362.5111
SMILESCCN(C\C=C\C)c1nc(C)nc2n(cc(C)c12)-c1c(C)cc(C)cc1C